Error compiling Android 4.4

Hello,

I try to compile Android 4.4 on Ubuntu 13.04. But i get a some "unexpected EOF" errors.

Code:
including ./system/security/softkeymaster/Android.mk ... including ./system/vold/Android.mk ... including ./tools/external/fat32lib/Android.mk ... target SharedLib: libandroid (out/target/product/generic/obj/SHARED_LIBRARIES/libandroid_intermediates/LINKED/libandroid.so) target SharedLib: libwilhelm (out/target/product/generic/obj/SHARED_LIBRARIES/libwilhelm_intermediates/LINKED/libwilhelm.so) Install: out/target/product/generic/system/lib/libstagefright.so target SharedLib: libjnigraphics (out/target/product/generic/obj/SHARED_LIBRARIES/libjnigraphics_intermediates/LINKED/libjnigraphics.so) target Strip: libbcc.sha1 (out/target/product/generic/obj/lib/libbcc.sha1.so) target SharedLib: libwebviewchromium_plat_support (out/target/product/generic/obj/SHARED_LIBRARIES/libwebviewchromium_plat_support_intermediates/LINKED/libwebviewchromium_plat_support.so) target SharedLib: libbluetooth_jni (out/target/product/generic/obj/SHARED_LIBRARIES/libbluetooth_jni_intermediates/LINKED/libbluetooth_jni.so) Copying: out/target/common/obj/JAVA_LIBRARIES/android-support-v4-jellybean-mr1_intermediates/classes.jar Proguard: out/target/common/obj/APPS/Music_intermediates/proguard.classes.jar target Symbolic: libjni_pacprocessor (out/target/product/generic/symbols/system/lib/libjni_pacprocessor.so) Proguard: out/target/common/obj/APPS/PhotoTable_intermediates/proguard.classes.jar target Symbolic: libttscompat (out/target/product/generic/symbols/system/lib/libttscompat.so) Proguard: out/target/common/obj/APPS/QuickSearchBox_intermediates/proguard.classes.jar target Symbolic: app_process (out/target/product/generic/symbols/system/bin/app_process) target Symbolic: app_process__asan (out/target/product/generic/symbols/system/bin/asan/app_process) target Executable: dex2oat (out/target/product/generic/obj/EXECUTABLES/dex2oat_intermediates/LINKED/dex2oat) target Symbolic: libstagefright_httplive (out/target/product/generic/symbols/system/lib/libstagefright_httplive.so) target Symbolic: libstagefright_wfd (out/target/product/generic/symbols/system/lib/libstagefright_wfd.so) target Symbolic: screenrecord (out/target/product/generic/symbols/system/bin/screenrecord) target Symbolic: camera.goldfish.jpeg (out/target/product/generic/symbols/system/lib/hw/camera.goldfish.jpeg.so) target Symbolic: libFFTEm (out/target/product/generic/symbols/system/lib/libFFTEm.so) ProGuard, version 4.10 ProGuard, version 4.10 ProGuard, version 4.10 target Strip: libRSDriver (out/target/product/generic/obj/lib/libRSDriver.so) Reading program jar [/home/manner/Documents/android/out/target/common/obj/APPS/Music_intermediates/classes.jar] Reading program jar [/home/manner/Documents/android/out/target/common/obj/APPS/QuickSearchBox_intermediates/classes.jar] target Symbolic: libandroid_servers (out/target/product/generic/symbols/system/lib/libandroid_servers.so) Reading program jar [/home/manner/Documents/android/out/target/common/obj/APPS/PhotoTable_intermediates/classes.jar] target Symbolic: libaudioeffect_jni (out/target/product/generic/symbols/system/lib/libaudioeffect_jni.so) target Symbolic: libdrmframework_jni (out/target/product/generic/symbols/system/lib/libdrmframework_jni.so) Reading library jar [/home/manner/Documents/android/out/target/common/obj/JAVA_LIBRARIES/android_stubs_current_intermediates/classes.jar] Reading library jar [/home/manner/Documents/android/out/target/common/obj/JAVA_LIBRARIES/android_stubs_current_intermediates/classes.jar] target SharedLib: libmedia_jni (out/target/product/generic/obj/SHARED_LIBRARIES/libmedia_jni_intermediates/LINKED/libmedia_jni.so) target SharedLib: librs_jni (out/target/product/generic/obj/SHARED_LIBRARIES/librs_jni_intermediates/LINKED/librs_jni.so) target SharedLib: libsoundpool (out/target/product/generic/obj/SHARED_LIBRARIES/libsoundpool_intermediates/LINKED/libsoundpool.so) target SharedLib: libstagefright_chromium_http (out/target/product/generic/obj/SHARED_LIBRARIES/libstagefright_chromium_http_intermediates/LINKED/libstagefright_chromium_http.so) Install: out/target/product/generic/system/lib/libstagefright_soft_aacdec.so Install: out/target/product/generic/system/lib/libstagefright_soft_aacenc.so Reading library jar [/home/manner/Documents/android/out/target/common/obj/JAVA_LIBRARIES/android_stubs_current_intermediates/classes.jar] Install: out/target/product/generic/system/lib/libstagefright_soft_amrdec.so Install: out/target/product/generic/system/lib/libstagefright_soft_amrnbenc.so Error: Can't read [/home/manner/Documents/android/out/target/common/obj/JAVA_LIBRARIES/android_stubs_current_intermediates/classes.jar] (unexpected EOF) make: *** [out/target/common/obj/APPS/Music_intermediates/proguard.classes.jar] Error 1 make: *** Waiting for unfinished jobs.... Error: Can't read [/home/manner/Documents/android/out/target/common/obj/JAVA_LIBRARIES/android_stubs_current_intermediates/classes.jar] (unexpected EOF) make: *** [out/target/common/obj/APPS/PhotoTable_intermediates/proguard.classes.jar] Error 1 Error: Can't read [/home/manner/Documents/android/out/target/common/obj/JAVA_LIBRARIES/android_stubs_current_intermediates/classes.jar] (unexpected EOF) make: *** [out/target/common/obj/APPS/QuickSearchBox_intermediates/proguard.classes.jar] Error 1

Do you know any solutions?

Thanks

Show Accepted Answer

Guest Quick Reply (No URL, BBcode or HTML)

Last post by merle.grant
2 hours ago
Last post by carlo85
1 hour ago
Last post by green.elvis
43 minutes ago
Last post by oortiz
2 hours ago
Last post by abigale68
49 minutes ago
album artwork
Started by lstehr
Last post by tomas.batz
2 hours ago
Last post by tkessler
3 hours ago
Last post by gillian.watsica
4 hours ago
Last post by wolf.vita
42 minutes ago
Last post by hickle.orie
2 hours ago